{"text_format":"1","workbook":"xlsx","n_sheets":6,"sheets":["Welcome","Enter Student Data","Lookup Tool","--Cut Scores--","--Full Score Bands--","--Data List for Dropdowns--"],"not_rendered":{"charts":1,"images":3,"macros":1,"external_links":0,"defined_names":18,"comments":0,"pivot_tables":0},"unopened":[],"bounds":{"document_bytes":16777216,"sheet_cells":100000,"rows_first":2000,"rows_last":500,"rows_between":2000,"halvings":0,"cell_chars":16384,"cell_head_chars":4096},"cells_cut":0,"cells_raw":0,"read":"whole","date_system":"1900"}

{"sheet":"Welcome","index":0,"n_rows":6,"n_cols":1,"rows_kept":6,"cut":false,"hidden":false,"merged":[]}
["Welcome to the Student-Level Trajectory Report Generator \n\nThis analysis tool allows you to explore the scale score growth needed for students to be \"on track\" for future proficiency on the ISAT summative assessments in ELA/Literacy and Mathematics. \n\nThe trajectory target for students in Idaho is reaching proficiency in three years.\n\nSchool performance on this measure will be included on the Idaho Report Card. You can run this analysis for an individual student or for multiple students using the template provided. Follow the steps below to produce your trajectory report.\n"]
["1) Input Student Data"]
["2) Run Report"]
["Interested in exploring proficiency targets without creating a full student trajectory report? Use the Lookup Tool available in the Lookup Tool spreadsheet."]
["NOTES: Estimates are for informational purposes only and are intended to help illustrate the basic framework of the trajectory calculation. The calculations in this tool are a not a substitute for the trajectory calculations in Idaho's school accountability system. Please be aware that some high-achieving students may already have achieved a summative scale score above the target scale score for proficiency three years in the future. This tool will set their target growth at zero. The full business rules document, to be posted on the Idaho State Department of Education website, will include specifics on the official trajectory calculations."]
["End of worksheet"]

{"sheet":"Enter Student Data","index":1,"n_rows":3,"n_cols":7,"rows_kept":3,"cut":false,"hidden":false,"merged":[]}
["This sheet contains six columns where you need to enter student information to create a trajectory estimate. \nBy default, there is sample entry in row 3 that you can replace. When complete, click the \"Done\" button or click on the \"Welcome\" spreadsheet."]
["EDUID","School","First Name ","Last Name","Subject","Last Year's Score","Current Grade"]
[1000000,"Sample School","Test","Student","ISAT Math",2300,8]

{"sheet":"Lookup Tool","index":2,"n_rows":30,"n_cols":10,"rows_kept":30,"cut":false,"hidden":false,"merged":[]}
["This lookup tool allows you to enter different options for subject, current grade, and scale score to explore trajectory targets "]
["Lookup Tool"]
["The three variables listed in the rows below \nallow you to generate trajectory targets","Enter the information in this row \nto explore different trajectory targets","Target Column"]
["Subject --->","ELA/Literacy",{"$f":"IF(B4 = \"ELA/Literacy\", \"F\", IF(B4 = \"Mathematics\", \"O\", \".\"))","v":"F"}]
["Current Grade --->","Select a grade","Years Left"]
["Last year's summative scale score --->",2000,3,{"$f":"SUM(B5)","v":0}]
[null,"Reaching Proficiency in Three Years                      ","Target Row"]
["Target scale score",{"$f":"C13","v":{"$error":"#VALUE!"}}]
["Total scale score growth needed to reach standard",{"$f":"MAX(C13-B6, 0)","v":{"$error":"#VALUE!"}},{"$f":"SUM(C6+B5)","v":{"$error":"#VALUE!"}}]
["Annual scale score growth needed (rounded up)",{"$f":"C15","v":{"$error":"#VALUE!"}},"Target Sheet"]
[null,null,{"$f":"\"'--Full Score Bands--'!\"","v":"'--Full Score Bands--'!"}]
[null,null,"Target Score"]
[null,null,{"$f":"INDIRECT(C11 & C4 & C9)","v":{"$error":"#VALUE!"}}]
[null,null,"Annual growth rounded up"]
[null,null,{"$f":"MAX(0, ROUNDUP((C13-B6) / C6, 0), 0)","v":{"$error":"#VALUE!"}}]
[]
[null,null,{"$f":"IF(B4 = \"ELA/Literacy\", \"D\", \"I\")","v":"D"}]
[null,null,{"$f":"IF(B4 = \"ELA/Literacy\", \"B\", \"K\")","v":"B"}]
[]
[]
[null,null,"Column --->",{"$f":"IF($B$4 = \"ELA/Literacy\", \"B\", \"K\")","v":"B"},{"$f":"IF($B$4 = \"ELA/Literacy\", \"C\", \"L\")","v":"C"},{"$f":"IF($B$4 = \"ELA/Literacy\", \"E\", \"N\")","v":"E"},{"$f":"IF($B$4 = \"ELA/Literacy\", \"G\", \"P\")","v":"G"},{"$f":"IF($B$4 = \"ELA/Literacy\", \"I\", \"R\")","v":"I"}]
[null,"Year","Scale Score","Minimum","Level 1","Level 2","Level 3","Level 4"]
["Years",2019,{"$f":"B6","v":2000}]
[1,2020,{"$f":"IF($C$6 >= A24, SUM(C23+$B$10), 0)","v":{"$error":"#VALUE!"}},{"$f":"INDIRECT($C$11 & D$21 & SUM($D$6+$A24))","v":0},{"$f":"INDIRECT($C$11 & E$21 & SUM($D$6+$A24))-D24","v":0},{"$f":"INDIRECT($C$11 & F$21 & SUM($D$6+$A24))-$D24-$E24","v":0},{"$f":"INDIRECT($C$11 & G$21 & SUM($D$6+$A24))-$D24-$E24-$F24","v":0},{"$f":"INDIRECT($C$11 & H$21 & SUM($D$6+$A24))-$D24-$E24-$F24-$G24","v":0},null,{"$f":"SUM($B$5+A24-1)","v":{"$error":"#VALUE!"}}]
[2,2021,{"$error":"#VALUE!"},{"$f":"INDIRECT($C$11 & D$21 & SUM($D$6+$A25))","v":"Level 1"},{"$f":"INDIRECT($C$11 & E$21 & SUM($D$6+$A25))-D25","v":{"$error":"#VALUE!"}},{"$f":"INDIRECT($C$11 & F$21 & SUM($D$6+$A25))-$D25-$E25","v":{"$error":"#VALUE!"}},{"$f":"INDIRECT($C$11 & G$21 & SUM($D$6+$A25))-$D25-$E25-$F25","v":{"$error":"#VALUE!"}},{"$f":"INDIRECT($C$11 & H$21 & SUM($D$6+$A25))-$D25-$E25-$F25-$G25","v":{"$error":"#VALUE!"}},null,{"$error":"#VALUE!"}]
[3,2022,{"$error":"#VALUE!"},"From",{"$error":"#VALUE!"},{"$error":"#VALUE!"},{"$error":"#VALUE!"},{"$error":"#VALUE!"},null,{"$error":"#VALUE!"}]
[4,2021,0,2001,365,65,58,322,null,{"$error":"#VALUE!"}]
[5,2022,0,2032,{"$f":"INDIRECT($C$11 & E$21 & SUM($D$6+$A28))-D28","v":383},57,60,335,null,{"$error":"#VALUE!"}]
[6,2023,0,2056,385,60,80,335,null,{"$error":"#VALUE!"}]
[7,2024,0,2079,{"$f":"INDIRECT($C$11 & E$21 & SUM($D$6+$A30))-D30","v":377},74,87,320,null,{"$error":"#VALUE!"}]

{"sheet":"--Cut Scores--","index":3,"n_rows":14,"n_cols":10,"rows_kept":14,"cut":false,"hidden":true,"merged":[]}
["ELA Cut Scores",null,null,null,null,"Math Cut Scores"]
["Grade","Level 1","Level 2","Level 3","Level 4","Grade","Level 1","Level 2","Level 3","Level 4"]
[null,"From","From","From","From",null,"From","From","From","From"]
[3,2001,2367,2432,2490,3,2071,2381,2436,2501]
[4,2032,2416,2473,2533,4,2090,2411,2485,2549]
[5,2056,2442,2502,2582,5,2095,2455,2528,2579]
[6,2079,2457,2531,2618,6,2103,2473,2552,2610]
[7,2082,2479,2552,2649,7,2108,2484,2567,2635]
[8,2097,2487,2567,2668,8,2113,2504,2586,2653]
[9,2102,2488,2571,2670,9,2118,2515,2599,2676]
[10,2102,2491,2577,2677,10,2118,2529,2614,2697]
[11,2102,2493,2583,2682,11,2118,2543,2628,2718]
[]
["Source: http://idaho.portal.airast.org/wp-content/uploads/ELA-and-Math-Cut-Scores.pdf "]

{"sheet":"--Full Score Bands--","index":4,"n_rows":14,"n_cols":18,"rows_kept":14,"cut":false,"hidden":true,"merged":[[1,14,1,15],[1,16,1,17],[1,1,1,2],[1,3,1,4],[1,5,1,6],[1,7,1,8],[1,10,1,11],[1,12,1,13]]}
["ELA Cut Scores",null,null,null,null,null,null,null,null,"Math Cut Scores"]
["Grade","Level 1",null,"Level 2",null,"Level 3",null,"Level 4",null,"Grade","Level 1",null,"Level 2",null,"Level 3",null,"Level 4"]
[null,"From","To","From","To","From","To","From","To",null,"From","To","From","To","From","To","From","To"]
[3,2001,2366,2367,2431,2432,2489,2490,2811,3,2071,2380,2381,2435,2436,2500,2501,2762]
[4,2032,2415,2416,2472,2473,2532,2533,2867,4,2090,2410,2411,2484,2485,2548,2549,2834]
[5,2056,2441,2442,2501,2502,2581,2582,2916,5,2095,2454,2455,2527,2528,2578,2579,2891]
[6,2079,2456,2457,2530,2531,2617,2618,2937,6,2103,2472,2473,2551,2552,2609,2610,2911]
[7,2082,2478,2479,2551,2552,2648,2649,2964,7,2108,2483,2484,2566,2567,2634,2635,2964]
[8,2097,2486,2487,2566,2567,2667,2668,2989,8,2113,2503,2504,2585,2586,2652,2653,2993]
[9,2102,2487,2488,2570,2571,2669,2670,3032,9,2118,2514,2515,2598,2599,2675,2676,3085]
[10,2102,2490,2491,2576,2577,2676,2677,3032,10,2118,2528,2529,2613,2614,2696,2697,3085]
[11,2102,2492,2493,2582,2583,2681,2682,3032,11,2118,2542,2543,1627,2628,2717,2718,3085]
[]
["Source: http://idaho.portal.airast.org/wp-content/uploads/ELA-and-Math-Cut-Scores.pdf "]

{"sheet":"--Data List for Dropdowns--","index":5,"n_rows":1004,"n_cols":29,"rows_kept":1004,"cut":false,"hidden":true,"merged":[]}
["This is background data. Do not adjust."]
[]
["Grades",4,5,6,7,8,9,10,null,null,"Subject",null,"LookupSubjects","LookupGrades","LookupEndPoint",null,null,null,"Trajectory End Point","Trajectory End Point for Grade 10","Trajectory Based on",null,null,null,"Data Source",null,null,null,"Scores"]
["Select","Select a target end point","Select a target end point","Select a target end point","Select a target end point","Select a target end point","Select a target end point","Select a target end point",null,null,"ISAT ELA",null,"Select a subject","Select a grade","Select a trajectory target",null,null,null,"Select a trajectory target","This school year","Select a trajectory calculation",null,null,null,"Online Reporting System (ORS)",null,null,null,2000]
[{"$f":"IF(OR(#REF! > 0, 'Enter Student Data'!#REF!>0,#REF! > 0,#REF! > 0, 'Enter Student Data'!#REF!>0,#REF! > 0), \" \",  4)","v":{"$error":"#REF!"}},"This school year","This school year","This school year","This school year","This school year","10th grade","This school year",null,null,"ISAT Math",null,"ELA/Literacy",4,"Reaching proficiency by the end of this year",null,null,null,"Three years",null,"Student's average annual growth",null,null,null,"Other",null,null,null,2001]
[{"$f":"IF(OR(#REF! > 0, 'Enter Student Data'!#REF!>0,#REF! > 0), \" \",  5)","v":{"$error":"#REF!"}},"Three years from now","Three years from now","8th grade","8th grade",null,null,null,null,null,null,null,"Mathematics",5,"Reaching proficiency three years from now",null,null,null,"10th grade",null,"Student's growth last year",null,null,null,null,null,null,null,2002]
[6,"8th grade","8th grade",null,null,null,null,null,null,null,null,null,null,6,"Reaching proficiency by the end of 8th grade",null,null,null,null,null,null,null,null,null,null,null,null,null,2003]
[7,null,null,null,null,null,null,null,null,null,null,null,null,7,"Reaching proficiency by the end of 10th grade",null,null,null,null,null,null,null,null,null,null,null,null,null,2004]
[8,null,null,null,null,null,null,null,null,null,null,null,null,8,null,null,null,null,null,null,null,null,null,null,null,null,null,null,2005]
[null,null,null,null,null,null,null,null,null,null,null,null,null,9,null,null,null,null,null,null,null,null,null,null,null,null,null,null,2006]
[null,null,null,null,null,null,null,null,null,null,null,null,null,10,null,null,null,null,null,null,null,null,null,null,null,null,null,null,2007]
[null,null,null,null,null,null,null,null,null,null,null,null,null,null,null,null,null,null,null,null,null,null,null,null,null,null,null,null,2008]
[null,null,null,null,null,null,null,null,null,null,null,null,null,null,null,null,null,null,null,null,null,null,null,null,null,null,null,null,2009]
[null,null,null,null,null,null,null,null,null,null,null,null,null,null,null,null,null,null,null,null,null,null,null,null,null,null,null,null,2010]
[null,null,null,null,null,null,null,null,null,null,null,null,null,null,null,null,null,null,null,null,null,null,null,null,null,null,null,null,2011]
[null,null,null,null,null,null,null,null,null,null,null,null,null,null,null,null,null,null,null,null,null,null,null,null,null,null,null,null,2012]
[null,null,null,null,null,null,null,null,null,null,null,null,null,null,null,null,null,null,null,null,null,null,null,null,null,null,null,null,2013]
[null,null,null,null,null,null,null,null,null,null,null,null,null,null,null,null,null,null,null,null,null,null,null,null,null,null,null,null,2014]
[null,null,null,null,null,null,null,null,null,null,null,null,null,null,null,null,null,null,null,null,null,null,null,null,null,null,null,null,2015]
[null,null,null,null,null,null,null,null,null,null,null,null,null,null,null,null,null,null,null,null,null,null,null,null,null,null,null,null,2016]
[null,null,null,null,null,null,null,null,null,null,null,null,null,null,null,null,null,null,null,null,null,null,null,null,null,null,null,null,2017]
[null,null,null,null,null,null,null,null,null,null,null,null,null,null,null,null,null,null,null,null,null,null,null,null,null,null,null,null,2018]
[null,null,null,null,null,null,null,null,null,null,null,null,null,null,null,null,null,null,null,null,null,null,null,null,null,null,null,null,2019]
[null,null,null,null,null,null,null,null,null,null,null,null,null,null,null,null,null,null,null,null,null,null,null,null,null,null,null,null,2020]
[null,null,null,null,null,null,null,null,null,null,null,null,null,null,null,null,null,null,null,null,null,null,null,null,null,null,null,null,2021]
[null,null,null,null,null,null,null,null,null,null,null,null,null,null,null,null,null,null,null,null,null,null,null,null,null,null,null,null,2022]
[null,null,null,null,null,null,null,null,null,null,null,null,null,null,null,null,null,null,null,null,null,null,null,null,null,null,null,null,2023]
[null,null,null,null,null,null,null,null,null,null,null,null,null,null,null,null,null,null,null,null,null,null,null,null,null,null,null,null,2024]
[null,null,null,null,null,null,null,null,null,null,null,null,null,null,null,null,null,null,null,null,null,null,null,null,null,null,null,null,2025]
[null,null,null,null,null,null,null,null,null,null,null,null,null,null,null,null,null,null,null,null,null,null,null,null,null,null,null,null,2026]
[null,null,null,null,null,null,null,null,null,null,null,null,null,null,null,null,null,null,null,null,null,null,null,null,null,null,null,null,2027]
[null,null,null,null,null,null,null,null,null,null,null,null,null,null,null,null,null,null,null,null,null,null,null,null,null,null,null,null,2028]
[null,null,null,null,null,null,null,null,null,null,null,null,null,null,null,null,null,null,null,null,null,null,null,null,null,null,null,null,2029]
[null,null,null,null,null,null,null,null,null,null,null,null,null,null,null,null,null,null,null,null,null,null,null,null,null,null,null,null,2030]
[null,null,null,null,null,null,null,null,null,null,null,null,null,null,null,null,null,null,null,null,null,null,null,null,null,null,null,null,2031]
[null,null,null,null,null,null,null,null,null,null,null,null,null,null,null,null,null,null,null,null,null,null,null,null,null,null,null,null,2032]
[null,null,null,null,null,null,null,null,null,null,null,null,null,null,null,null,null,null,null,null,null,null,null,null,null,null,null,null,2033]
[null,null,null,null,null,null,null,null,null,null,null,null,null,null,null,null,null,null,null,null,null,null,null,null,null,null,null,null,2034]
[null,null,null,null,null,null,null,null,null,null,null,null,null,null,null,null,null,null,null,null,null,null,null,null,null,null,null,null,2035]
[null,null,null,null,null,null,null,null,null,null,null,null,null,null,null,null,null,null,null,null,null,null,null,null,null,null,null,null,2036]
[null,null,null,null,null,null,null,null,null,null,null,null,null,null,null,null,null,null,null,null,null,null,null,null,null,null,null,null,2037]
[null,null,null,null,null,null,null,null,null,null,null,null,null,null,null,null,null,null,null,null,null,null,null,null,null,null,null,null,2038]
[null,null,null,null,null,null,null,null,null,null,null,null,null,null,null,null,null,null,null,null,null,null,null,null,null,null,null,null,2039]
[null,null,null,null,null,null,null,null,null,null,null,null,null,null,null,null,null,null,null,null,null,null,null,null,null,null,null,null,2040]
[null,null,null,null,null,null,null,null,null,null,null,null,null,null,null,null,null,null,null,null,null,null,null,null,null,null,null,null,2041]
[null,null,null,null,null,null,null,null,null,null,null,null,null,null,null,null,null,null,null,null,null,null,null,null,null,null,null,null,2042]
[null,null,null,null,null,null,null,null,null,null,null,null,null,null,null,null,null,null,null,null,null,null,null,null,null,null,null,null,2043]
[null,null,null,null,null,null,null,null,null,null,null,null,null,null,null,null,null,null,null,null,null,null,null,null,null,null,null,null,2044]
[null,null,null,null,null,null,null,null,null,null,null,null,null,null,null,null,null,null,null,null,null,null,null,null,null,null,null,null,2045]
[null,null,null,null,null,null,null,null,null,null,null,null,null,null,null,null,null,null,null,null,null,null,null,null,null,null,null,null,2046]
[null,null,null,null,null,null,null,null,null,null,null,null,null,null,null,null,null,null,null,null,null,null,null,null,null,null,null,null,2047]
[null,null,null,null,null,null,null,null,null,null,null,null,null,null,null,null,null,null,null,null,null,null,null,null,null,null,null,null,2048]
[null,null,null,null,null,null,null,null,null,null,null,null,null,null,null,null,null,null,null,null,null,null,null,null,null,null,null,null,2049]
[null,null,null,null,null,null,null,null,null,null,null,null,null,null,null,null,null,null,null,null,null,null,null,null,null,null,null,null,2050]
[null,null,null,null,null,null,null,null,null,null,null,null,null,null,null,null,null,null,null,null,null,null,null,null,null,null,null,null,2051]
[null,null,null,null,null,null,null,null,null,null,null,null,null,null,null,null,null,null,null,null,null,null,null,null,null,null,null,null,2052]
[null,null,null,null,null,null,null,null,null,null,null,null,null,null,null,null,null,null,null,null,null,null,null,null,null,null,null,null,2053]
[null,null,null,null,null,null,null,null,null,null,null,null,null,null,null,null,null,null,null,null,null,null,null,null,null,null,null,null,2054]
[null,null,null,null,null,null,null,null,null,null,null,null,null,null,null,null,null,null,null,null,null,null,null,null,null,null,null,null,2055]
[null,null,null,null,null,null,null,null,null,null,null,null,null,null,null,null,null,null,null,null,null,null,null,null,null,null,null,null,2056]
[null,null,null,null,null,null,null,null,null,null,null,null,null,null,null,null,null,null,null,null,null,null,null,null,null,null,null,null,2057]
[null,null,null,null,null,null,null,null,null,null,null,null,null,null,null,null,null,null,null,null,null,null,null,null,null,null,null,null,2058]
[null,null,null,null,null,null,null,null,null,null,null,null,null,null,null,null,null,null,null,null,null,null,null,null,null,null,null,null,2059]
[null,null,null,null,null,null,null,null,null,null,null,null,null,null,null,null,null,null,null,null,null,null,null,null,null,null,null,null,2060]
[null,null,null,null,null,null,null,null,null,null,null,null,null,null,null,null,null,null,null,null,null,null,null,null,null,null,null,null,2061]
[null,null,null,null,null,null,null,null,null,null,null,null,null,null,null,null,null,null,null,null,null,null,null,null,null,null,null,null,2062]
[null,null,null,null,null,null,null,null,null,null,null,null,null,null,null,null,null,null,null,null,null,null,null,null,null,null,null,null,2063]
[null,null,null,null,null,null,null,null,null,null,null,null,null,null,null,null,null,null,null,null,null,null,null,null,null,null,null,null,2064]
[null,null,null,null,null,null,null,null,null,null,null,null,null,null,null,null,null,null,null,null,null,null,null,null,null,null,null,null,2065]
[null,null,null,null,null,null,null,null,null,null,null,null,null,null,null,null,null,null,null,null,null,null,null,null,null,null,null,null,2066]
[null,null,null,null,null,null,null,null,null,null,null,null,null,null,null,null,null,null,null,null,null,null,null,null,null,null,null,null,2067]
[null,null,null,null,null,null,null,null,null,null,null,null,null,null,null,null,null,null,null,null,null,null,null,null,null,null,null,null,2068]
[null,null,null,null,null,null,null,null,null,null,null,null,null,null,null,null,null,null,null,null,null,null,null,null,null,null,null,null,2069]
[null,null,null,null,null,null,null,null,null,null,null,null,null,null,null,null,null,null,null,null,null,null,null,null,null,null,null,null,2070]
[null,null,null,null,null,null,null,null,null,null,null,null,null,null,null,null,null,null,null,null,null,null,null,null,null,null,null,null,2071]
[null,null,null,null,null,null,null,null,null,null,null,null,null,null,null,null,null,null,null,null,null,null,null,null,null,null,null,null,2072]
[null,null,null,null,null,null,null,null,null,null,null,null,null,null,null,null,null,null,null,null,null,null,null,null,null,null,null,null,2073]
[null,null,null,null,null,null,null,null,null,null,null,null,null,null,null,null,null,null,null,null,null,null,null,null,null,null,null,null,2074]
[null,null,null,null,null,null,null,null,null,null,null,null,null,null,null,null,null,null,null,null,null,null,null,null,null,null,null,null,2075]
[null,null,null,null,null,null,null,null,null,null,null,null,null,null,null,null,null,null,null,null,null,null,null,null,null,null,null,null,2076]
{"$rows_left_out":924}